Reaction Details
TargetHistone deacetylase 4
LigandBDBM348884
Substrate/Competitorn/a
Meas. Tech.Inhibition Assay
Ki 489±n/a nM
Citation Wright, DLAnderson, ACVan Heyst, MOnonye, S Substituted tropolone derivatives and methods of use US Patent US9790158 Publication Date 10/17/2017
 
Histone deacetylase 4
Name:Histone deacetylase 4
Type:Enzyme
Mol. Mass.:119049.39
Organism:Homo sapiens (Human)
Description:P56524
Residue:1084
BDBM348884
NameBDBM348884
Synonyms:US9790158, 10
Typen/a
Emp. Form.C11H14O2
Mol. Mass.178.2277
SMILESCC(C)(C)c1cccc(O)c(=O)c1