Reaction Details
TargetcGMP-inhibited 3',5'-cyclic phosphodiesterase 3A [388-1112]
LigandBDBM15311
Substrate/CompetitorBDBM10851
Meas. Tech.PDE SPA Enzyme Inhibition Assay
IC50 0.11±n/a nM
Citation Edmondson, SDMastracchio, AHe, JChung, CCForrest, MJHofsess, SMacIntyre, EMetzger, JO'Connor, NPatel, KTong, XTota, MRVan der Ploeg, LHVarnerin, JPFisher, MHWyvratt, MJWeber, AEParmee, ER Benzyl vinylogous amide substituted aryldihydropyridazinones and aryldimethylpyrazolones as potent and selective PDE3B inhibitors. Bioorg Med Chem Lett13:3983-7 (2003) 
 
cGMP-inhibited 3',5'-cyclic phosphodiesterase 3A [388-1112]
Name:cGMP-inhibited 3',5'-cyclic phosphodiesterase 3A [388-1112]
Type:Enzyme
Mol. Mass.:80817.39
Organism:Homo sapiens (Human)
Description:PDE3A (388-1112) was expressed as soluble proteins in Escherichia coli.
Residue:725
BDBM15311
BDBM10851
NameBDBM15311
Synonyms:(5R)-5-methyl-6-{4-[(2-{[3-(3-nitrophenyl)phenyl]methyl}-3-oxocyclohex-1-en-1-yl)amino]phenyl}-2,3,4,5-tetrahydropyridazin-3-one | dihydropyridazinone 9b
TypeSmall organic molecule
Emp. Form.C30H28N4O4
Mol. Mass.508.5677
SMILESC[C@@H]1CC(=O)NN=C1c1ccc(NC2=C(Cc3cccc(c3)-c3cccc(c3)[N+]([O-])=O)C(=O)CCC2)cc1