Reaction Details
TargetDihydroorotate dehydrogenase (quinone), mitochondrial [30-395]
LigandBDBM15352
Substrate/CompetitorBDBM15346
Meas. Tech.DHODH Inhibition Assay
IC50 200000±n/a nM
Citation Baldwin, JMichnoff, CHMalmquist, NAWhite, JRoth, MGRathod, PKPhillips, MA High-throughput screening for potent and selective inhibitors of Plasmodium falciparum dihydroorotate dehydrogenase. J Biol Chem280:21847-53 (2005) 
 
Dihydroorotate dehydrogenase (quinone), mitochondrial [30-395]
Name:Dihydroorotate dehydrogenase (quinone), mitochondrial [30-395]
Type:Enzyme
Mol. Mass.:39678.95
Organism:Homo sapiens (Human)
Description:Recombinant human DHODH (amino acids 30 to 395) was cloned and expressed in E. coli.
Residue:366
BDBM15352
BDBM15346
NameBDBM15352
Synonyms:ChemBridge compound no. 7 | N-(3,4-difluorophenyl)-2-methyl-3-nitrobenzamide
TypeSmall organic molecule
Emp. Form.C14H10F2N2O3
Mol. Mass.292.2376
SMILESCc1c(cccc1[N+]([O-])=O)C(=O)Nc1ccc(F)c(F)c1