Reaction Details
TargetDihydroorotate dehydrogenase (quinone), mitochondrial [R265A]
LigandBDBM15345
Substrate/CompetitorBDBM15346
Meas. Tech.DHODH Inhibition Assay
IC50 80±n/a nM
Citation Baldwin, JMichnoff, CHMalmquist, NAWhite, JRoth, MGRathod, PKPhillips, MA High-throughput screening for potent and selective inhibitors of Plasmodium falciparum dihydroorotate dehydrogenase. J Biol Chem280:21847-53 (2005) 
 
Dihydroorotate dehydrogenase (quinone), mitochondrial [R265A]
Name:Dihydroorotate dehydrogenase (quinone), mitochondrial [R265A]
Type:Enzyme
Mol. Mass.:65495.77
Organism:Plasmodium falciparum
Description:Q54A96[R265A]
Residue:569
BDBM15345
BDBM15346
NameBDBM15345
Synonyms:Asinex compound no. 1 | N-(2,4-dichlorophenyl)naphthalene-2-carboxamide
TypeSmall organic molecule
Emp. Form.C17H11Cl2NO
Mol. Mass.316.181
SMILESClc1ccc(NC(=O)c2ccc3ccccc3c2)c(Cl)c1