Reaction Details
TargetDihydroorotate dehydrogenase (quinone), mitochondrial [R265A]
LigandBDBM15348
Substrate/CompetitorBDBM15346
Meas. Tech.DHODH Inhibition Assay
IC50 300±n/a nM
Citation Baldwin, JMichnoff, CHMalmquist, NAWhite, JRoth, MGRathod, PKPhillips, MA High-throughput screening for potent and selective inhibitors of Plasmodium falciparum dihydroorotate dehydrogenase. J Biol Chem280:21847-53 (2005) 
 
Dihydroorotate dehydrogenase (quinone), mitochondrial [R265A]
Name:Dihydroorotate dehydrogenase (quinone), mitochondrial [R265A]
Type:Enzyme
Mol. Mass.:65495.77
Organism:Plasmodium falciparum
Description:Q54A96[R265A]
Residue:569
BDBM15348
BDBM15346
NameBDBM15348
Synonyms:ChemBridge compound no. 3 | N-(2-fluorophenyl)naphthalene-2-carboxamide
TypeSmall organic molecule
Emp. Form.C17H12FNO
Mol. Mass.265.2817
SMILESFc1ccccc1NC(=O)c1ccc2ccccc2c1