Reaction Details
TargetDihydroorotate dehydrogenase (quinone), mitochondrial [R265A]
LigandBDBM15355
Substrate/CompetitorBDBM15346
Meas. Tech.DHODH Inhibition Assay
IC50 370±n/a nM
Citation Baldwin, JMichnoff, CHMalmquist, NAWhite, JRoth, MGRathod, PKPhillips, MA High-throughput screening for potent and selective inhibitors of Plasmodium falciparum dihydroorotate dehydrogenase. J Biol Chem280:21847-53 (2005) 
 
Dihydroorotate dehydrogenase (quinone), mitochondrial [R265A]
Name:Dihydroorotate dehydrogenase (quinone), mitochondrial [R265A]
Type:Enzyme
Mol. Mass.:65495.77
Organism:Plasmodium falciparum
Description:Q54A96[R265A]
Residue:569
BDBM15355
BDBM15346
NameBDBM15355
Synonyms:2-methyl-3-nitro-N-[3-(trifluoromethyl)phenyl]benzamide | Asinex compound no. 10
TypeSmall organic molecule
Emp. Form.C15H11F3N2O3
Mol. Mass.324.2546
SMILESCc1c(cccc1[N+]([O-])=O)C(=O)Nc1cccc(c1)C(F)(F)F