Reaction Details
TargetDihydroorotate dehydrogenase (quinone), mitochondrial [R265A]
LigandBDBM15356
Substrate/CompetitorBDBM15346
Meas. Tech.DHODH Inhibition Assay
IC50 340±n/a nM
Citation Baldwin, JMichnoff, CHMalmquist, NAWhite, JRoth, MGRathod, PKPhillips, MA High-throughput screening for potent and selective inhibitors of Plasmodium falciparum dihydroorotate dehydrogenase. J Biol Chem280:21847-53 (2005) 
 
Dihydroorotate dehydrogenase (quinone), mitochondrial [R265A]
Name:Dihydroorotate dehydrogenase (quinone), mitochondrial [R265A]
Type:Enzyme
Mol. Mass.:65495.77
Organism:Plasmodium falciparum
Description:Q54A96[R265A]
Residue:569
BDBM15356
BDBM15346
NameBDBM15356
Synonyms:1-naphthalen-1-yl-3-[2-(trifluoromethyl)phenyl]urea | SPECS compound no. 11
TypeSmall organic molecule
Emp. Form.C18H13F3N2O
Mol. Mass.330.3038
SMILESFC(F)(F)c1ccccc1NC(=O)Nc1cccc2ccccc12