Reaction Details
TargetDihydroorotate dehydrogenase (quinone), mitochondrial [H185A]
LigandBDBM15349
Substrate/CompetitorBDBM15346
Meas. Tech.DHODH Inhibition Assay
IC50 140000±n/a nM
Citation Baldwin, JMichnoff, CHMalmquist, NAWhite, JRoth, MGRathod, PKPhillips, MA High-throughput screening for potent and selective inhibitors of Plasmodium falciparum dihydroorotate dehydrogenase. J Biol Chem280:21847-53 (2005) 
 
Dihydroorotate dehydrogenase (quinone), mitochondrial [H185A]
Name:Dihydroorotate dehydrogenase (quinone), mitochondrial [H185A]
Type:Enzyme
Mol. Mass.:65515.32
Organism:Plasmodium falciparum
Description:Q54A96[H185A]
Residue:569
BDBM15349
BDBM15346
NameBDBM15349
Synonyms:Asinex compound no. 4 | N-(3-bromophenyl)-2-methyl-3-nitrobenzamide
TypeSmall organic molecule
Emp. Form.C14H11BrN2O3
Mol. Mass.335.153
SMILESCc1c(cccc1[N+]([O-])=O)C(=O)Nc1cccc(Br)c1