Reaction Details
TargetDihydroorotate dehydrogenase (quinone), mitochondrial [H185A]
LigandBDBM15353
Substrate/CompetitorBDBM15346
Meas. Tech.DHODH Inhibition Assay
IC50 180000±n/a nM
Citation Baldwin, JMichnoff, CHMalmquist, NAWhite, JRoth, MGRathod, PKPhillips, MA High-throughput screening for potent and selective inhibitors of Plasmodium falciparum dihydroorotate dehydrogenase. J Biol Chem280:21847-53 (2005) 
 
Dihydroorotate dehydrogenase (quinone), mitochondrial [H185A]
Name:Dihydroorotate dehydrogenase (quinone), mitochondrial [H185A]
Type:Enzyme
Mol. Mass.:65515.32
Organism:Plasmodium falciparum
Description:Q54A96[H185A]
Residue:569
BDBM15353
BDBM15346
NameBDBM15353
Synonyms:2-methyl-N-(naphthalen-1-yl)-3-nitrobenzamide | ChemBridge compound no. 8
TypeSmall organic molecule
Emp. Form.C18H14N2O3
Mol. Mass.306.3154
SMILESCc1c(cccc1[N+]([O-])=O)C(=O)Nc1cccc2ccccc12