Reaction Details
TargetDihydroorotate dehydrogenase (quinone), mitochondrial [H185A]
LigandBDBM15358
Substrate/CompetitorBDBM15346
Meas. Tech.DHODH Inhibition Assay
IC50>400000±n/a nM
Citation Baldwin, JMichnoff, CHMalmquist, NAWhite, JRoth, MGRathod, PKPhillips, MA High-throughput screening for potent and selective inhibitors of Plasmodium falciparum dihydroorotate dehydrogenase. J Biol Chem280:21847-53 (2005) 
 
Dihydroorotate dehydrogenase (quinone), mitochondrial [H185A]
Name:Dihydroorotate dehydrogenase (quinone), mitochondrial [H185A]
Type:Enzyme
Mol. Mass.:65515.32
Organism:Plasmodium falciparum
Description:Q54A96[H185A]
Residue:569
BDBM15358
BDBM15346
NameBDBM15358
Synonyms:3-(4-chlorophenyl)-1-quinolin-8-ylurea | Asinex compound no. 13
TypeSmall organic molecule
Emp. Form.C16H12ClN3O
Mol. Mass.297.739
SMILESClc1ccc(NC(=O)Nc2cccc3cccnc23)cc1