Reaction Details
TargetHeat shock protein HSP 90-beta
LigandBDBM15359
Substrate/CompetitorBDBM15360
Meas. Tech.Fluorescence Polarization (FP) Assay
pH7.4±n/a
Temperature295.15±n/a K
IC50 1270±n/a nM
Citation Dymock, BWBarril, XBrough, PACansfield, JEMassey, AMcDonald, EHubbard, RESurgenor, ARoughley, SDWebb, PWorkman, PWright, LDrysdale, MJ Novel, potent small-molecule inhibitors of the molecular chaperone Hsp90 discovered through structure-based design. J Med Chem48:4212-5 (2005) 
 
Heat shock protein HSP 90-beta
Name:Heat shock protein HSP 90-beta
Type:Molecular Chaperone
Mol. Mass.:83229.45
Organism:Homo sapiens (Human)
Description:P08238
Residue:724
BDBM15359
BDBM15360
NameBDBM15359
Synonyms:(4E,6Z,8S,9S,10E,12S,13R,14S,16R)-13-hydroxy-8,14-dimethoxy-4,10,12,16-tetramethyl-3,20,22-trioxo-19-(prop-2-en-1-ylamino)-2-azabicyclo[16.3.1]docosa-1(21),4,6,10,18-pentaen-9-yl carbamate 17-AAG CHEMBL109480 Tanespimycin
TypeSmall organic molecule
Emp. Form.C31H43N3O8
Mol. Mass.585.6884
SMILESCO[C@H]1C[C@H](C)Cc2c(O)c(NC(=O)C(C)=CC=C[C@H](OC)[C@@H](OC(N)=O)\C(C)=C\[C@H](C)[C@H]1O)cc(O)c2N=CC=C