Reaction Details
TargetHeat shock protein HSP 90-beta
LigandBDBM15372
Substrate/CompetitorBDBM15360
Meas. Tech.Fluorescence Polarization (FP) Assay
pH7.4±n/a
Temperature295.15±n/a K
IC50 25±n/a nM
Citation Dymock, BWBarril, XBrough, PACansfield, JEMassey, AMcDonald, EHubbard, RESurgenor, ARoughley, SDWebb, PWorkman, PWright, LDrysdale, MJ Novel, potent small-molecule inhibitors of the molecular chaperone Hsp90 discovered through structure-based design. J Med Chem48:4212-5 (2005) 
 
Heat shock protein HSP 90-beta
Name:Heat shock protein HSP 90-beta
Type:Molecular Chaperone
Mol. Mass.:83229.45
Organism:Homo sapiens (Human)
Description:P08238
Residue:724
BDBM15372
BDBM15360
NameBDBM15372
Synonyms:3-(5-chloro-2,4-dihydroxyphenyl)-N-ethyl-4-(4-methoxyphenyl)-1H-pyrazole-5-carboxamide Compound 11 VER-49009
TypeSmall organic molecule
Emp. Form.C19H18ClN3O4
Mol. Mass.387.817
SMILESCCNC(=O)c1[nH]nc(c1-c1ccc(OC)cc1)-c1cc(Cl)c(O)cc1O