Reaction Details
TargetHeat shock protein HSP 90-beta
LigandBDBM15406
Substrate/CompetitorBDBM15360
Meas. Tech.Fluorescence Polarization (FP) Assay
pH7.4±n/a
Temperature295.15±n/a K
IC50 6600±n/a nM
Citation Barril, XBrough, PDrysdale, MHubbard, REMassey, ASurgenor, AWright, L Structure-based discovery of a new class of Hsp90 inhibitors. Bioorg Med Chem Lett15:5187-91 (2005) 
 
Heat shock protein HSP 90-beta
Name:Heat shock protein HSP 90-beta
Type:Molecular Chaperone
Mol. Mass.:83229.45
Organism:Homo sapiens (Human)
Description:P08238
Residue:724
BDBM15406
BDBM15360
NameBDBM15406
Synonyms:4-ethyl-N-[4-hydroxy-3-(2-hydroxynaphthalen-1-yl)phenyl]benzene-1-sulfonamide | naphthol compound 9
TypeSmall organic molecule
Emp. Form.C24H21NO4S
Mol. Mass.419.493
SMILESCCc1ccc(cc1)S(=O)(=O)Nc1ccc(O)c(c1)-c1c(O)ccc2ccccc12