Reaction Details
TargetDipeptidyl peptidase 4
LigandBDBM15497
Substrate/CompetitorBDBM11057
Meas. Tech.DPP Inhibition Assay
Ki 3.2±n/a nM
Citation Backes, BJLongenecker, KHamilton, GLStewart, KLai, CKopecka, Hvon Geldern, TWMadar, DJPei, ZLubben, THZinker, BATian, ZBallaron, SJStashko, MAMika, AKBeno, DWKempf-Grote, AJBlack-Schaefer, CSham, HLTrevillyan, JM Pyrrolidine-constrained phenethylamines: The design of potent, selective, and pharmacologically efficacious dipeptidyl peptidase IV (DPP4) inhibitors from a lead-like screening hit. Bioorg Med Chem Lett17:2005-12 (2007) 
 
Dipeptidyl peptidase 4
Name:Dipeptidyl peptidase 4
Type:Enzyme
Mol. Mass.:88271.01
Organism:Homo sapiens (Human)
Description:P27487
Residue:766
BDBM15497
BDBM11057
NameBDBM15497
Synonyms:(3R,4S)-1-{6-[3-(morpholine-4-sulfonyl)phenyl]pyrimidin-4-yl}-4-(2,4,5-trifluorophenyl)pyrrolidin-3-amine | Pyrrolidine-constrained phenethylamine 29f
TypeSmall organic molecule
Emp. Form.C24H24F3N5O3S
Mol. Mass.519.539
SMILESN[C@H]1CN(C[C@@H]1c1cc(F)c(F)cc1F)c1cc(ncn1)-c1cccc(c1)S(=O)(=O)N1CCOCC1