Reaction Details
TargetCytochrome P450 11B1, mitochondrial
LigandBDBM347679
Substrate/Competitorn/a
Meas. Tech.Inhibition Assay
EC50 0.001±n/a nM
Citation Aebi, JAmrein, KHornsperger, BKuhn, BLi, DLiu, YMaerki, HPMartin, REMayweg, AVTan, XWang, LWu, J Pyridinyloxy- and phenyloxy-pyrazolyl compounds US Patent US9790217 Publication Date 10/17/2017
 
Cytochrome P450 11B1, mitochondrial
Name:Cytochrome P450 11B1, mitochondrial
Type:Enzyme
Mol. Mass.:57591.44
Organism:Homo sapiens (Human)
Description:P15538
Residue:503
BDBM347679
NameBDBM347679
Synonyms:(E)-2-(4-Chlorophenoxy)-3- (dimethylamino)-1-(2-methoxyphenyl)prop- 2-en-1-one US9790217, 5
TypeSmall organic molecule
Emp. Form.C18H18ClNO3
Mol. Mass.331.793
SMILESCOc1ccccc1C(=O)C(\Oc1ccc(Cl)cc1)=C/N(C)C