Reaction Details
TargetCytochrome P450 11B1, mitochondrial
LigandBDBM347692
Substrate/Competitorn/a
Meas. Tech.Inhibition Assay
EC50 0.159±n/a nM
Citation Aebi, JAmrein, KHornsperger, BKuhn, BLi, DLiu, YMaerki, HPMartin, REMayweg, AVTan, XWang, LWu, J Pyridinyloxy- and phenyloxy-pyrazolyl compounds US Patent US9790217 Publication Date 10/17/2017
 
Cytochrome P450 11B1, mitochondrial
Name:Cytochrome P450 11B1, mitochondrial
Type:Enzyme
Mol. Mass.:57591.44
Organism:Homo sapiens (Human)
Description:P15538
Residue:503
BDBM347692
NameBDBM347692
Synonyms:(E)-2-(4-Chlorophenoxy)-1-(2,4- difluorophenyl)-3-(dimethylamino)prop-2- en-1-one | US9790217, 15
TypeSmall organic molecule
Emp. Form.C17H14ClF2NO2
Mol. Mass.337.748
SMILESCN(C)\C=C(\Oc1ccc(Cl)cc1)C(=O)c1ccc(F)cc1F