Reaction Details
TargetCytochrome P450 11B1, mitochondrial
LigandBDBM347703
Substrate/Competitorn/a
Meas. Tech.Inhibition Assay
EC50 0.018±n/a nM
Citation Aebi, JAmrein, KHornsperger, BKuhn, BLi, DLiu, YMaerki, HPMartin, REMayweg, AVTan, XWang, LWu, J Pyridinyloxy- and phenyloxy-pyrazolyl compounds US Patent US9790217 Publication Date 10/17/2017
 
Cytochrome P450 11B1, mitochondrial
Name:Cytochrome P450 11B1, mitochondrial
Type:Enzyme
Mol. Mass.:57591.44
Organism:Homo sapiens (Human)
Description:P15538
Residue:503
BDBM347703
NameBDBM347703
Synonyms:(E)-1-[(2-Chlorobenzoyl)-2- (dimethylamino)vinyloxy]benzonitrile | US9790217, 25
TypeSmall organic molecule
Emp. Form.C18H17ClN2O2
Mol. Mass.328.793
SMILESCN(C)C(=C\OC1(CC=CC=C1)C#N)\C(=O)c1ccccc1Cl