Reaction Details
TargetCytochrome P450 11B1, mitochondrial
LigandBDBM347711
Substrate/Competitorn/a
Meas. Tech.Inhibition Assay
EC50 0.262±n/a nM
Citation Aebi, JAmrein, KHornsperger, BKuhn, BLi, DLiu, YMaerki, HPMartin, REMayweg, AVTan, XWang, LWu, J Pyridinyloxy- and phenyloxy-pyrazolyl compounds US Patent US9790217 Publication Date 10/17/2017
 
Cytochrome P450 11B1, mitochondrial
Name:Cytochrome P450 11B1, mitochondrial
Type:Enzyme
Mol. Mass.:57591.44
Organism:Homo sapiens (Human)
Description:P15538
Residue:503
BDBM347711
NameBDBM347711
Synonyms:(E)-1-(2-Chloro-3-fluoro-phenyl)-2- (4-chlorophenoxy)-3-(dimethylamino)prop-2- en-1-one | US9790217, 34
TypeSmall organic molecule
Emp. Form.C17H14Cl2FNO2
Mol. Mass.354.203
SMILESCN(C)\C=C(\Oc1ccc(Cl)cc1)C(=O)c1cccc(F)c1Cl