Reaction Details
TargetE3 ubiquitin-protein ligase Mdm2 [17-125]
LigandBDBM223705
Substrate/Competitorn/a
Meas. Tech.FRET Assay
Temperature298.15±n/a K
IC50 0.3439±n/a nM
Commentsextracted
Citation Cammarano, CMChristopher, MPDinsmore, CDoll, RJFradera Llinas, FXLi, CMachacek, MMartinez, MNair, LGPan, WReutershan, MHShizuka, MSteinhuebel, DPSun, BThompson, CFTrotter, BWWang, YYang, LBogen, SLVoss, MEPanda, JKurissery, AT 2,6,7,8 substituted purines as HDM2 inhibitors US Patent US9540377 Publication Date 1/10/2017
 
E3 ubiquitin-protein ligase Mdm2 [17-125]
Name:E3 ubiquitin-protein ligase Mdm2 [17-125]
Type:Enzyme Catalytic Domain
Mol. Mass.:12522.24
Organism:Homo sapiens (Human)
Description:Residue 17 to 125
Residue:109
BDBM223705
NameBDBM223705
Synonyms:3-(6-{[(1r)-1- cyclobutylethyl]amino}- 8- (hexahydrocyclopenta [b][1,4]oxazin- 4(4ah)-yl)-7-[(trans- 4- methylcyclohexyl) methyl]-7h-purin-2- yl)-1,2,4-oxadiazol- 5(2h)-one (diastereomer 1) US9540377, 11.133 US9540377, 11.149
TypeSmall organic molecule
Emp. Form.C28H40N8O3
Mol. Mass.536.669
SMILESC[C@@H](Nc1nc(nc2nc(N3CCOC4CCCC34)n(C[C@H]3CC[C@H](C)CC3)c12)-c1noc(=O)[nH]1)C1CCC1