Reaction Details
TargetE3 ubiquitin-protein ligase Mdm2 [17-125]
LigandBDBM224173
Substrate/Competitorn/a
Meas. Tech.FRET Assay
Temperature298.15±n/a K
IC50 0.5846±n/a nM
Commentsextracted
Citation Cammarano, CMChristopher, MPDinsmore, CDoll, RJFradera Llinas, FXLi, CMachacek, MMartinez, MNair, LGPan, WReutershan, MHShizuka, MSteinhuebel, DPSun, BThompson, CFTrotter, BWWang, YYang, LBogen, SLVoss, MEPanda, JKurissery, AT 2,6,7,8 substituted purines as HDM2 inhibitors US Patent US9540377 Publication Date 1/10/2017
 
E3 ubiquitin-protein ligase Mdm2 [17-125]
Name:E3 ubiquitin-protein ligase Mdm2 [17-125]
Type:Enzyme Catalytic Domain
Mol. Mass.:12522.24
Organism:Homo sapiens (Human)
Description:Residue 17 to 125
Residue:109
BDBM224173
NameBDBM224173
Synonyms:3-{6-(5- chloropyridin-3-yl)- 8-[(3r)-3-(2- fluorophenyl)morpho- lin-4-yl]-7-[(trans-4- methylcyclohexyl) methyl]-7h-purin-2-yl}- 1,2,4-oxadiazol- 5(4h)-one | US9540377, 16.92
TypeSmall organic molecule
Emp. Form.C30H30ClFN8O3
Mol. Mass.605.062
SMILESC[C@H]1CC[C@H](Cn2c(nc3nc(nc(-c4cncc(Cl)c4)c23)-c2noc(=O)[nH]2)N2CCOC[C@H]2c2ccccc2F)CC1