Reaction Details
TargetE3 ubiquitin-protein ligase Mdm2 [17-125]
LigandBDBM227651
Substrate/Competitorn/a
Meas. Tech.FRET Assay
Temperature298.15±n/a K
IC50 0.176±n/a nM
Commentsextracted
Citation Cammarano, CMChristopher, MPDinsmore, CDoll, RJFradera Llinas, FXLi, CMachacek, MMartinez, MNair, LGPan, WReutershan, MHShizuka, MSteinhuebel, DPSun, BThompson, CFTrotter, BWWang, YYang, LBogen, SLVoss, MEPanda, JKurissery, AT 2,6,7,8 substituted purines as HDM2 inhibitors US Patent US9540377 Publication Date 1/10/2017
 
E3 ubiquitin-protein ligase Mdm2 [17-125]
Name:E3 ubiquitin-protein ligase Mdm2 [17-125]
Type:Enzyme Catalytic Domain
Mol. Mass.:12522.24
Organism:Homo sapiens (Human)
Description:Residue 17 to 125
Residue:109
BDBM227651
NameBDBM227651
Synonyms:6-(5-chloropyridin-3-yl)- 8-[1-fluoro-1-(2- fluorophenyl)ethyl]-7- [(trans-4- methylcyclohexyl)methyl]- 7h-purine-2-carboxylic acid (enantiomer 1) US9540377, 23.67
TypeSmall organic molecule
Emp. Form.C27H26ClF2N5O2
Mol. Mass.525.977
SMILESC[C@H]1CC[C@H](Cn2c(nc3nc(nc(-c4cncc(Cl)c4)c23)C(O)=O)C(C)(F)c2ccccc2F)CC1