Reaction Details
TargetE3 ubiquitin-protein ligase Mdm2 [17-125]
LigandBDBM227696
Substrate/Competitorn/a
Meas. Tech.FRET Assay
Temperature298.15±n/a K
IC50 2.775±n/a nM
Commentsextracted
Citation Cammarano, CMChristopher, MPDinsmore, CDoll, RJFradera Llinas, FXLi, CMachacek, MMartinez, MNair, LGPan, WReutershan, MHShizuka, MSteinhuebel, DPSun, BThompson, CFTrotter, BWWang, YYang, LBogen, SLVoss, MEPanda, JKurissery, AT 2,6,7,8 substituted purines as HDM2 inhibitors US Patent US9540377 Publication Date 1/10/2017
 
E3 ubiquitin-protein ligase Mdm2 [17-125]
Name:E3 ubiquitin-protein ligase Mdm2 [17-125]
Type:Enzyme Catalytic Domain
Mol. Mass.:12522.24
Organism:Homo sapiens (Human)
Description:Residue 17 to 125
Residue:109
BDBM227696
NameBDBM227696
Synonyms:2-{1-[6-(5-chloropyridin- 3-yl)-7-[(trans-4- methylcyclohexyl)methyl]- 2-(5-oxo-4,5-dihydro- 1,2,4-oxadiazol-3-yl)-7h- purin-8-yl]-1- methoxyethyl}benzonitrile (enantiomer 1) US9540377, 23.112
TypeSmall organic molecule
Emp. Form.C30H29ClN8O3
Mol. Mass.585.056
SMILESCOC(C)(c1nc2nc(nc(-c3cncc(Cl)c3)c2n1C[C@H]1CC[C@H](C)CC1)-c1noc(=O)[nH]1)c1ccccc1C#N