Reaction Details
TargetInterleukin-1 receptor-associated kinase 1 [194-712]
LigandBDBM347804
Substrate/Competitorn/a
Meas. Tech.Enzymatic Assay
IC50 550±n/a nM
Citation Jorand-Lebrun, CJones, RWon, ACNguyen, NJohnson, TLDeselm, LCPanda, K Heteroaryl compounds as IRAK inhibitors and uses thereof US Patent US9790221 Publication Date 10/17/2017
 
Interleukin-1 receptor-associated kinase 1 [194-712]
Name:Interleukin-1 receptor-associated kinase 1 [194-712]
Type:Enzyme Catalytic Domain
Mol. Mass.:55943.99
Organism:Homo sapiens (Human)
Description:aa 194-712
Residue:519
BDBM347804
NameBDBM347804
Synonyms:US9790221, Compound 10
TypeSmall organic molecule
Emp. Form.C24H28N8
Mol. Mass.428.5327
SMILESCn1ccc(n1)-c1cnc(nc1NCC1CCCNC1)-c1cccc(c1)-c1cnn(C)c1