Reaction Details
TargetInterleukin-1 receptor-associated kinase 1 [194-712]
LigandBDBM347829
Substrate/Competitorn/a
Meas. Tech.Enzymatic Assay
IC50 550±n/a nM
Citation Jorand-Lebrun, CJones, RWon, ACNguyen, NJohnson, TLDeselm, LCPanda, K Heteroaryl compounds as IRAK inhibitors and uses thereof US Patent US9790221 Publication Date 10/17/2017
 
Interleukin-1 receptor-associated kinase 1 [194-712]
Name:Interleukin-1 receptor-associated kinase 1 [194-712]
Type:Enzyme Catalytic Domain
Mol. Mass.:55943.99
Organism:Homo sapiens (Human)
Description:aa 194-712
Residue:519
BDBM347829
NameBDBM347829
Synonyms:US9790221, Compound 35
TypeSmall organic molecule
Emp. Form.C21H23N7O
Mol. Mass.389.4536
SMILESCn1cc(cn1)-c1cccc(c1)-c1ncc(-c2cnn(C)c2)c(NCCCO)n1