Reaction Details
TargetInterleukin-1 receptor-associated kinase 1 [194-712]
LigandBDBM348001
Substrate/Competitorn/a
Meas. Tech.Enzymatic Assay
IC50<100±n/a nM
Citation Jorand-Lebrun, CJones, RWon, ACNguyen, NJohnson, TLDeselm, LCPanda, K Heteroaryl compounds as IRAK inhibitors and uses thereof US Patent US9790221 Publication Date 10/17/2017
 
Interleukin-1 receptor-associated kinase 1 [194-712]
Name:Interleukin-1 receptor-associated kinase 1 [194-712]
Type:Enzyme Catalytic Domain
Mol. Mass.:55943.99
Organism:Homo sapiens (Human)
Description:aa 194-712
Residue:519
BDBM348001
NameBDBM348001
Synonyms:US9790221, Compound 209
TypeSmall organic molecule
Emp. Form.C26H30N8O2S2
Mol. Mass.550.699
SMILESCc1nnc(s1)-c1cnc(nc1NC1CCC(CC1)NS(=O)(=O)C1CC1)-c1cccc(c1)-c1cnn(C)c1