Reaction Details
TargetPhosphatidylinositol 4-phosphate 3-kinase C2 domain-containing subunit beta
LigandBDBM348153
Substrate/Competitorn/a
Meas. Tech.Inhibition Assay
IC50 550±n/a nM
Citation Ren, PLiu, YLi, LChan, KWilson, TE Heterocyclic kinase inhibitors US Patent US9790228 Publication Date 10/17/2017
 
Phosphatidylinositol 4-phosphate 3-kinase C2 domain-containing subunit beta
Name:Phosphatidylinositol 4-phosphate 3-kinase C2 domain-containing subunit beta
Type:Enzyme
Mol. Mass.:184784.86
Organism:Homo sapiens (Human)
Description:O00750
Residue:1634
BDBM348153
NameBDBM348153
Synonyms:US9790228, Compound 72
TypeSmall organic molecule
Emp. Form.C27H28N8O
Mol. Mass.480.5642
SMILESCC(c1cc2ccccc2nc1N1CCN(C)CC1)n1nc(-c2cccc(O)c2)c2c(N)ncnc12