Reaction Details
TargetPhosphatidylinositol 4-phosphate 3-kinase C2 domain-containing subunit beta
LigandBDBM348180
Substrate/Competitorn/a
Meas. Tech.Inhibition Assay
IC50 550±n/a nM
Citation Ren, PLiu, YLi, LChan, KWilson, TE Heterocyclic kinase inhibitors US Patent US9790228 Publication Date 10/17/2017
 
Phosphatidylinositol 4-phosphate 3-kinase C2 domain-containing subunit beta
Name:Phosphatidylinositol 4-phosphate 3-kinase C2 domain-containing subunit beta
Type:Enzyme
Mol. Mass.:184784.86
Organism:Homo sapiens (Human)
Description:O00750
Residue:1634
BDBM348180
NameBDBM348180
Synonyms:US9790228, Compound 99
TypeSmall organic molecule
Emp. Form.C24H20N8S
Mol. Mass.452.534
SMILESCCc1nc2ccccc2cc1Cn1nc(-c2ccc3nc(N)sc3c2)c2c(N)ncnc12