Reaction Details
TargetPhosphatidylinositol 4-phosphate 3-kinase C2 domain-containing subunit beta
LigandBDBM348255
Substrate/Competitorn/a
Meas. Tech.Inhibition Assay
IC50<100±n/a nM
Citation Ren, PLiu, YLi, LChan, KWilson, TE Heterocyclic kinase inhibitors US Patent US9790228 Publication Date 10/17/2017
 
Phosphatidylinositol 4-phosphate 3-kinase C2 domain-containing subunit beta
Name:Phosphatidylinositol 4-phosphate 3-kinase C2 domain-containing subunit beta
Type:Enzyme
Mol. Mass.:184784.86
Organism:Homo sapiens (Human)
Description:O00750
Residue:1634
BDBM348255
NameBDBM348255
Synonyms:US9790228, Compound 174
TypeSmall organic molecule
Emp. Form.C26H24FN7O
Mol. Mass.469.5135
SMILESNc1ncnc2n(Cc3cc4ccccc4nc3CN3CCCC3)nc(-c3cc(O)cc(F)c3)c12