Reaction Details
TargetAmine oxidase [flavin-containing] B
LigandBDBM15604
Substrate/CompetitorBDBM10990
Meas. Tech.MAO Activity Assay
Ki 30±n/a nM
Citation La Regina, GSilvestri, RArtico, MLavecchia, ANovellino, EBefani, OTurini, PAgostinelli, E New pyrrole inhibitors of monoamine oxidase: synthesis, biological evaluation, and structural determinants of MAO-A and MAO-B selectivity. J Med Chem50:922-31 (2007) 
 
Amine oxidase [flavin-containing] B
Name:Amine oxidase [flavin-containing] B
Type:PROTEIN
Mol. Mass.:58428.94
Organism:Bos taurus
Description:ChEMBL_1501478
Residue:520
BDBM15604
BDBM10990
NameBDBM15604
Synonyms:(R)-N-(alpha-Cyclohexylethyl),N-methyl-1H-pyrrole-2-carboxamide pyrrole inhibitor 29
TypeSmall organic molecule
Emp. Form.C14H22N2O
Mol. Mass.234.3373
SMILESC[C@H](C1CCCCC1)N(C)C(=O)c1ccc[nH]1