Reaction Details
Target15-hydroxyprostaglandin dehydrogenase [NAD(+)]
LigandBDBM347359
Substrate/Competitorn/a
Meas. Tech.In Vitro Assay
IC50 1.23±n/a nM
Citation Markowitz, SWillson, JKPosner, BAReady, JZhang, YTai, HAntczak, MGerson, SBae, KYang, SYDesai, A Compositions and methods of modulating 15-PGDH activity US Patent US9790233 Publication Date 10/17/2017
 
15-hydroxyprostaglandin dehydrogenase [NAD(+)]
Name:15-hydroxyprostaglandin dehydrogenase [NAD(+)]
Type:Enzyme
Mol. Mass.:28974.46
Organism:Homo sapiens (Human)
Description:P15428
Residue:266
BDBM347359
NameBDBM347359
Synonyms:US10301320, ID SW033291 US20230285402, ID # SW206976 | US9789116, SW033291
TypeSmall organic molecule
Emp. Form.C21H20N2OS3
Mol. Mass.412.591
SMILESCCCCS(=O)c1sc2nc(cc(-c3ccccc3)c2c1N)-c1cccs1