Reaction Details
TargetLysine-specific histone demethylase 1A
LigandBDBM283222
Substrate/Competitorn/a
Meas. Tech.In Vitro Enzyme Inhibition Assay LSD-1
IC50<100±n/a nM
Citation Chen, YKKanouni, TKaldor, SWStafford, JAVeal, JM Inhibitors of lysine specific demethylase-1 US Patent US10207999 Publication Date 2/19/2019
 
Lysine-specific histone demethylase 1A
Name:Lysine-specific histone demethylase 1A
Type:Enzyme
Mol. Mass.:92901.01
Organism:Homo sapiens (Human)
Description:O60341
Residue:852
BDBM283222
NameBDBM283222
Synonyms:2-fluoro-4-[5-(3-fluoro-4-methoxy- phenyl)-1-methyl-2-(4-methyl- amino-piperidin-1-yl)-6-oxo-1,6- dihydro-pyrimidin-4-yl]- benzonitrile US10207999, Example 12 US10548896, Example 12 US10960005, Example 12 US9573930, Example 12 US9776974, Example 12
TypeSmall organic molecule
Emp. Form.C25H25F2N5O2
Mol. Mass.465.4951
SMILESCNC1CCN(CC1)c1nc(-c2ccc(C#N)c(F)c2)c(-c2ccc(OC)c(F)c2)c(=O)n1C