Reaction Details
TargetLysine-specific histone demethylase 1A
LigandBDBM283249
Substrate/Competitorn/a
Meas. Tech.In Vitro Enzyme Inhibition Assay LSD-1
IC50<100±n/a nM
Citation Chen, YKKanouni, TKaldor, SWStafford, JAVeal, JM Inhibitors of lysine specific demethylase-1 US Patent US10207999 Publication Date 2/19/2019
 
Lysine-specific histone demethylase 1A
Name:Lysine-specific histone demethylase 1A
Type:Enzyme
Mol. Mass.:92901.01
Organism:Homo sapiens (Human)
Description:O60341
Residue:852
BDBM283249
NameBDBM283249
Synonyms:4-{2-(4-amino-piperidin-1-yl)-1- methyl-6-oxo-5-[1-(2,2,2-trifluoro- ethyl)-1H-pyrazol-4-yl]-1,6- dihydro-pyrimidin-4-yl}-2-fluoro- benzonitrile US10207999, Example 34 US10548896, Example 34 US10960005, Example 34 US9573930, Example 34 US9776974, Example 34
TypeSmall organic molecule
Emp. Form.C22H21F4N7O
Mol. Mass.475.4421
SMILESCn1c(nc(-c2ccc(C#N)c(F)c2)c(-c2cnn(CC(F)(F)F)c2)c1=O)N1CCC(N)CC1