Reaction Details
TargetLysine-specific histone demethylase 1A
LigandBDBM283270
Substrate/Competitorn/a
Meas. Tech.In Vitro Enzyme Inhibition Assay LSD-1
IC50<100±n/a nM
Citation Chen, YKKanouni, TKaldor, SWStafford, JAVeal, JM Inhibitors of lysine specific demethylase-1 US Patent US10207999 Publication Date 2/19/2019
 
Lysine-specific histone demethylase 1A
Name:Lysine-specific histone demethylase 1A
Type:Enzyme
Mol. Mass.:92901.01
Organism:Homo sapiens (Human)
Description:O60341
Residue:852
BDBM283270
NameBDBM283270
Synonyms:2-fluoro-4-[5-(4-methoxy-phenyl)- 1-methyl-6-oxo-2-(piperidin-4- ylamino)-1,6-dihydro-pyrimidin-4- yl]-benzonitrile US10207999, Example 53 US10548896, Example 53 US10960005, Example 53 US9573930, Example 53 US9776974, Example 53
TypeSmall organic molecule
Emp. Form.C24H24FN5O2
Mol. Mass.433.4781
SMILESCOc1ccc(cc1)-c1c(nc(NC2CCNCC2)n(C)c1=O)-c1ccc(C#N)c(F)c1