Reaction Details
TargetN-acetyltransferase Eis
LigandBDBM349591
Substrate/Competitorn/a
Meas. Tech.Eis inhibition assay
IC50 5800±n/a nM
Citation Garneau-Tsodikova, STsodikov, OVPosey, JE Eis inhibitors US Patent US10208000 Publication Date 2/19/2019
 
N-acetyltransferase Eis
Name:N-acetyltransferase Eis
Type:PROTEIN
Mol. Mass.:43803.37
Organism:Mycobacterium tuberculosis (strain ATCC 25618 / H37Rv)
Description:ChEMBL_116995
Residue:402
BDBM349591
NameBDBM349591
Synonyms:US10208000, Compound 33
TypeSmall organic molecule
Emp. Form.C15H13N3O4S
Mol. Mass.331.346
SMILESCN(c1ccccc1)S(=O)(=O)c1ccc2[nH]c(=O)c(=O)[nH]c2c1