Reaction Details
TargetN-acetyltransferase Eis
LigandBDBM349592
Substrate/Competitorn/a
Meas. Tech.Eis inhibition assay
IC50 100.0±n/a nM
Citation Garneau-Tsodikova, STsodikov, OVPosey, JE Eis inhibitors US Patent US10208000 Publication Date 2/19/2019
 
N-acetyltransferase Eis
Name:N-acetyltransferase Eis
Type:PROTEIN
Mol. Mass.:43803.37
Organism:Mycobacterium tuberculosis (strain ATCC 25618 / H37Rv)
Description:ChEMBL_116995
Residue:402
BDBM349592
NameBDBM349592
Synonyms:US10208000, Compound 34
TypeSmall organic molecule
Emp. Form.C15H12ClN3O4S
Mol. Mass.365.791
SMILESCN(c1ccc(Cl)cc1)S(=O)(=O)c1ccc2[nH]c(=O)c(=O)[nH]c2c1