Reaction Details
TargetN-acetyltransferase Eis
LigandBDBM349595
Substrate/Competitorn/a
Meas. Tech.Eis inhibition assay
IC50 3000±n/a nM
Citation Garneau-Tsodikova, STsodikov, OVPosey, JE Eis inhibitors US Patent US10208000 Publication Date 2/19/2019
 
N-acetyltransferase Eis
Name:N-acetyltransferase Eis
Type:PROTEIN
Mol. Mass.:43803.37
Organism:Mycobacterium tuberculosis (strain ATCC 25618 / H37Rv)
Description:ChEMBL_116995
Residue:402
BDBM349595
NameBDBM349595
Synonyms:US10208000, Compound 37
TypeSmall organic molecule
Emp. Form.C15H12FN3O4S
Mol. Mass.349.337
SMILESCN(c1cccc(F)c1)S(=O)(=O)c1ccc2[nH]c(=O)c(=O)[nH]c2c1