Reaction Details
TargetChitotriosidase-1
LigandBDBM349915
Substrate/Competitorn/a
Meas. Tech.Human CHIT1 Activity Assay
IC50<100±n/a nM
Citation Mazur, MKoralewski, RBorek, BOlejniczak, SCzestkowski, WJPiotrowicz, MCOlczak, JPGolebiowski, AABartoszewicz, AMaziarz, EKowalski, M Substituted amino triazoles useful as human chitinase inhibitors US Patent US10208020 Publication Date 2/19/2019
 
Chitotriosidase-1
Name:Chitotriosidase-1
Type:Enzyme
Mol. Mass.:51682.25
Organism:Homo sapiens (Human)
Description:Q13231
Residue:466
BDBM349915
NameBDBM349915
Synonyms:5-(4-((2S,5S)-5-(4-chlorobenzyl)-2-ethylmorpholino)piperidin-1-yl)-4H-1,2,4-triazol-3-amine US10538508, Example 5 | US9944624, Ex. 5
TypeSmall organic molecule
Emp. Form.C20H29ClN6O
Mol. Mass.404.937
SMILESCC[C@H]1CN(C(Cc2ccc(Cl)cc2)CO1)C1CCN(CC1)c1nnc(N)[nH]1