Reaction Details
TargetChitotriosidase-1
LigandBDBM349960
Substrate/Competitorn/a
Meas. Tech.Human CHIT1 Activity Assay
IC50<100±n/a nM
Citation Mazur, MKoralewski, RBorek, BOlejniczak, SCzestkowski, WJPiotrowicz, MCOlczak, JPGolebiowski, AABartoszewicz, AMaziarz, EKowalski, M Substituted amino triazoles useful as human chitinase inhibitors US Patent US10208020 Publication Date 2/19/2019
 
Chitotriosidase-1
Name:Chitotriosidase-1
Type:Enzyme
Mol. Mass.:51682.25
Organism:Homo sapiens (Human)
Description:Q13231
Residue:466
BDBM349960
NameBDBM349960
Synonyms:(3R,5S)-1-(1-(5-amino-1H-1,2,4-triazol-3-yl)piperidin-4-yl)-5-(4-chlorobenzyl)pyrrolidin-3-ol US10538508, Example 50 | US9944624, Ex. 50
TypeSmall organic molecule
Emp. Form.C18H25ClN6O
Mol. Mass.376.884
SMILESNc1nc(n[nH]1)N1CCC(CC1)N1C[C@H](O)C[C@@H]1Cc1ccc(Cl)cc1