Reaction Details
TargetLysine-specific histone demethylase 1A
LigandBDBM50158877
Substrate/Competitorn/a
Meas. Tech.Inhibition of Histone Demethylase Activity
IC50 90.0±n/a nM
Citation Vankayalapati, HSharma, SSorna, V Substituted-1H-benzo[d]imidazole series compounds as lysine-specific demethylase 1 (LSD1) inhibitors US Patent US9556170 Publication Date 1/31/2017
 
Lysine-specific histone demethylase 1A
Name:Lysine-specific histone demethylase 1A
Type:Enzyme
Mol. Mass.:92901.01
Organism:Homo sapiens (Human)
Description:O60341
Residue:852
BDBM50158877
NameBDBM50158877
Synonyms:CHEMBL3786908 | US9556170, 1
TypeSmall organic molecule
Emp. Form.C17H17ClN4O4S
Mol. Mass.408.859
SMILESOc1ccc(Cl)cc1Nc1nc2cc(ccc2[nH]1)S(=O)(=O)N1CCOCC1