Reaction Details
TargetProthrombin
LigandBDBM15824
Substrate/CompetitorBDBM13573
Meas. Tech.Thrombin Inhibition Assay
pH7.8±n/a
Temperature298.15±n/a K
Ki>10000±n/a nM
Citation Nazare, MEssrich, MWill, DWMatter, HRitter, KUrmann, MBauer, ASchreuder, HCzech, JLorenz, MLaux, VWehner, V Novel factor Xa inhibitors based on a 2-carboxyindole scaffold: SAR of P4 substituents in combination with a neutral P1 ligand. Bioorg Med Chem Lett14:4197-201 (2004) 
 
Prothrombin
Name:Prothrombin
Type:Protein
Mol. Mass.:70029.57
Organism:Homo sapiens (Human)
Description:P00734
Residue:622
BDBM15824
BDBM13573
NameBDBM15824
Synonyms:1-{[5-(5-chlorothiophen-2-yl)-1,2-oxazol-3-yl]methyl}-N-(1-ethylpiperidin-4-yl)-1H-indole-2-carboxamide | 2-carboxyindole-based inhibitor 8
TypeSmall organic molecule
Emp. Form.C24H25ClN4O2S
Mol. Mass.468.999
SMILESCCN1CCC(CC1)NC(=O)c1cc2ccccc2n1Cc1cc(on1)-c1ccc(Cl)s1