Reaction Details
TargetProthrombin
LigandBDBM15828
Substrate/CompetitorBDBM13573
Meas. Tech.Thrombin Inhibition Assay
pH7.8±n/a
Temperature298.15±n/a K
Ki 8220±n/a nM
Citation Nazare, MEssrich, MWill, DWMatter, HRitter, KUrmann, MBauer, ASchreuder, HCzech, JLorenz, MLaux, VWehner, V Novel factor Xa inhibitors based on a 2-carboxyindole scaffold: SAR of P4 substituents in combination with a neutral P1 ligand. Bioorg Med Chem Lett14:4197-201 (2004) 
 
Prothrombin
Name:Prothrombin
Type:Protein
Mol. Mass.:70029.57
Organism:Homo sapiens (Human)
Description:P00734
Residue:622
BDBM15828
BDBM13573
NameBDBM15828
Synonyms:1-{[5-(5-chlorothiophen-2-yl)-1,2-oxazol-3-yl]methyl}-N-(1-cyclopropylpiperidin-4-yl)-1H-indole-2-carboxamide | 2-carboxyindole-based inhibitor 13
TypeSmall organic molecule
Emp. Form.C25H25ClN4O2S
Mol. Mass.481.01
SMILESClc1ccc(s1)-c1cc(Cn2c(cc3ccccc23)C(=O)NC2CCN(CC2)C2CC2)no1