Reaction Details
TargetCoagulation factor X
LigandBDBM15848
Substrate/CompetitorBDBM12500
Meas. Tech.Factor Xa Inhibition Assay
Ki 12±n/a nM
Citation Nazare, MEssrich, MWill, DWMatter, HRitter, KUrmann, MBauer, ASchreuder, HCzech, JLorenz, MLaux, VWehner, V Novel factor Xa inhibitors based on a 2-carboxyindole scaffold: SAR of P4 substituents in combination with a neutral P1 ligand. Bioorg Med Chem Lett14:4197-201 (2004) 
 
Coagulation factor X
Name:Coagulation factor X
Type:Enzyme
Mol. Mass.:54726.60
Organism:Homo sapiens (Human)
Description:n/a
Residue:488
BDBM15848
BDBM12500
NameBDBM15848
Synonyms:1-{[5-(5-chlorothiophen-2-yl)-1,2-oxazol-3-yl]methyl}-N-[1-(pyridin-4-yl)azetidin-3-yl]-1H-indole-2-carboxamide | 2-carboxyindole-based inhibitor 33
TypeSmall organic molecule
Emp. Form.C25H20ClN5O2S
Mol. Mass.489.977
SMILESClc1ccc(s1)-c1cc(Cn2c(cc3ccccc23)C(=O)NC2CN(C2)c2ccncc2)no1