Reaction Details
TargetFibroblast growth factor receptor 2
LigandBDBM350042
Substrate/Competitorn/a
Meas. Tech.Enzyme Assay
IC50 0.800±n/a nM
Citation Andrews, SWBlake, JFCook, AGunawardana, IWHunt, KWMetcalf, ATMoreno, DRen, LTang, TP 2-aryl- and 2-heteroaryl-substituted 2-pyridazin-3(2H)-one compounds as inhibitors of FGFR tyrosine kinases US Patent US10208024 Publication Date 2/19/2019
 
Fibroblast growth factor receptor 2
Name:Fibroblast growth factor receptor 2
Type:Enzyme
Mol. Mass.:92015.45
Organism:Homo sapiens (Human)
Description:P21802
Residue:821
BDBM350042
NameBDBM350042
Synonyms:US10208024, Example 41 | US10766881, Example 41
TypeSmall organic molecule
Emp. Form.C24H25FN8O3
Mol. Mass.492.5055
SMILESCOc1cc(OC)c(F)c(c1)-n1nc(ccc1=O)-c1nc(cnc1N)-c1cnn(c1)C1CCNCC1