Reaction Details
TargetFibroblast growth factor receptor 2
LigandBDBM350052
Substrate/Competitorn/a
Meas. Tech.Enzyme Assay
IC50 0.600±n/a nM
Citation Andrews, SWBlake, JFCook, AGunawardana, IWHunt, KWMetcalf, ATMoreno, DRen, LTang, TP 2-aryl- and 2-heteroaryl-substituted 2-pyridazin-3(2H)-one compounds as inhibitors of FGFR tyrosine kinases US Patent US10208024 Publication Date 2/19/2019
 
Fibroblast growth factor receptor 2
Name:Fibroblast growth factor receptor 2
Type:Enzyme
Mol. Mass.:92015.45
Organism:Homo sapiens (Human)
Description:P21802
Residue:821
BDBM350052
NameBDBM350052
Synonyms:US10208024, Example 51 | US10766881, Example 51
TypeSmall organic molecule
Emp. Form.C28H34N8O4
Mol. Mass.546.6208
SMILESCOCCN1CCC(CC1)n1cc(cn1)-c1cnc(N)c(n1)-c1cc(C)c(=O)n(n1)-c1cc(OC)cc(OC)c1