Reaction Details
TargetProthrombin
LigandBDBM12372
Substrate/CompetitorBDBM13573
Meas. Tech.Thrombin Inhibition Assay
pH7.8±n/a
Temperature298.15±n/a K
Ki 2760±n/a nM
Citation Nazare, MEssrich, MWill, DWMatter, HRitter, KUrmann, MBauer, ASchreuder, HDudda, ACzech, JLorenz, MLaux, VWehner, V Factor Xa inhibitors based on a 2-carboxyindole scaffold: SAR of neutral P1 substituents. Bioorg Med Chem Lett14:4191-5 (2004) 
 
Prothrombin
Name:Prothrombin
Type:Protein
Mol. Mass.:70029.57
Organism:Homo sapiens (Human)
Description:P00734
Residue:622
BDBM12372
BDBM13573
NameBDBM12372
Synonyms:1-{[5-(5-chlorothiophen-2-yl)-1,2-oxazol-3-yl]methyl}-N-[1-(propan-2-yl)piperidin-4-yl]-1H-indole-2-carboxamide 2-carboxyindole 22 | 2-carboxyindole-based inhibitor 10
TypeSmall organic molecule
Emp. Form.C25H27ClN4O2S
Mol. Mass.483.025
SMILESCC(C)N1CCC(CC1)NC(=O)c1cc2ccccc2n1Cc1cc(on1)-c1ccc(Cl)s1