Reaction Details
TargetProthrombin
LigandBDBM12400
Substrate/CompetitorBDBM13573
Meas. Tech.Thrombin Inhibition Assay
pH7.8±n/a
Temperature298.15±n/a K
Ki>10000±n/a nM
Citation Nazare, MEssrich, MWill, DWMatter, HRitter, KUrmann, MBauer, ASchreuder, HDudda, ACzech, JLorenz, MLaux, VWehner, V Factor Xa inhibitors based on a 2-carboxyindole scaffold: SAR of neutral P1 substituents. Bioorg Med Chem Lett14:4191-5 (2004) 
 
Prothrombin
Name:Prothrombin
Type:Protein
Mol. Mass.:70029.57
Organism:Homo sapiens (Human)
Description:P00734
Residue:622
BDBM12400
BDBM13573
NameBDBM12400
Synonyms:1-[(4-Chloro-phenylcarbamoyl)-methyl]-1H-indole-2-carboxylic acid (1-isopropylpiperidin-4-yl)-amide 2-Carboxyindole Scaffold 45 | 2-carboxyindole 27
TypeSmall organic molecule
Emp. Form.C25H29ClN4O2
Mol. Mass.452.976
SMILESCC(C)N1CCC(CC1)NC(=O)c1cc2ccccc2n1CC(=O)Nc1ccc(Cl)cc1