Reaction Details
TargetTyrosine-protein kinase JAK2
LigandBDBM350094
Substrate/Competitorn/a
Meas. Tech.Biochemical JAK Kinase Assays
Ki 0.030±n/a nM
Citation Fatheree, PRBrandt, GESmith, CSullivan, SDVan Orden, LJKleinschek, MACrater, GD Fused imidazo-piperidine JAK inhibitors US Patent US10208040 Publication Date 2/19/2019
 
Tyrosine-protein kinase JAK2
Name:Tyrosine-protein kinase JAK2
Type:Protein
Mol. Mass.:130684.68
Organism:Homo sapiens (Human)
Description:O60674
Residue:1132
BDBM350094
NameBDBM350094
Synonyms:US10208040, Example 1-2 | US10519153, Example 1-2
TypeSmall organic molecule
Emp. Form.C29H34FN7O2
Mol. Mass.531.6244
SMILESCCc1cc(O)c(F)cc1-c1ccc2c(n[nH]c2c1)-c1nc2CC(NCc2[nH]1)C(=O)N1CCN(CC1)C(C)C