Reaction Details
TargetTyrosine-protein kinase JAK2
LigandBDBM350095
Substrate/Competitorn/a
Meas. Tech.Biochemical JAK Kinase Assays
Ki 0.060±n/a nM
Citation Fatheree, PRBrandt, GESmith, CSullivan, SDVan Orden, LJKleinschek, MACrater, GD Fused imidazo-piperidine JAK inhibitors US Patent US10208040 Publication Date 2/19/2019
 
Tyrosine-protein kinase JAK2
Name:Tyrosine-protein kinase JAK2
Type:Protein
Mol. Mass.:130684.68
Organism:Homo sapiens (Human)
Description:O60674
Residue:1132
BDBM350095
NameBDBM350095
Synonyms:US10208040, Example 1-12 US11667637, Example 1-12
TypeSmall organic molecule
Emp. Form.C30H36FN7O2
Mol. Mass.545.6509
SMILESCCc1cc(O)c(F)cc1-c1ccc2c(n[nH]c2c1)-c1nc2C[C@H](N(C)Cc2[nH]1)C(=O)N1CCN(CC1)C(C)C