Reaction Details
TargetCyclin-C/Cyclin-dependent kinase 8
LigandBDBM350186
Substrate/Competitorn/a
Meas. Tech.CDK8/Cyclin C Binding Assay
IC50 20.2±n/a nM
Citation Pastor Fernández, JMartínez González, SBlanco-Aparicio, CHernández Higueras, AIGómez De La Oliva, CARivero Buceta, VRiesco Fagundo, RC Condensed tricyclic compounds as protein kinase inhibitors US Patent US10208056 Publication Date 2/19/2019
 
Cyclin-C/Cyclin-dependent kinase 8
Name:Cyclin-C/Cyclin-dependent kinase 8
Synonyms:CDK8/Cyclin C
Type:n/a
Mol. Mass.:n/a
Description:ASSAY_ID of ChEMBL is 1562017
Components:This complex has 2 components.
Component 1
Name:Cyclin-dependent kinase 8
Type:Serine/threonine-protein kinase
Mol. Mass.:53300.21
Organism:Homo sapiens (Human)
Description:P49336
Residue:464
Component 2
Name:Cyclin-C
Synonyms:CCNC Cyclin C hSRB11
Type:PROTEIN
Mol. Mass.:33244.88
Organism:Homo sapiens (Human)
Description:ChEMBL_107900
Residue:283
BDBM350186
NameBDBM350186
Synonyms:US10208056, Compound 18
TypeSmall organic molecule
Emp. Form.C17H17F3N4O2
Mol. Mass.366.3377
SMILESNC(=O)c1cc2c([nH]1)-c1ccncc1OC21CCN(CC(F)(F)F)CC1