Reaction Details
TargetCyclin-C/Cyclin-dependent kinase 8
LigandBDBM350202
Substrate/Competitorn/a
Meas. Tech.CDK8/Cyclin C Binding Assay
IC50 2.10±n/a nM
Citation Pastor Fernández, JMartínez González, SBlanco-Aparicio, CHernández Higueras, AIGómez De La Oliva, CARivero Buceta, VRiesco Fagundo, RC Condensed tricyclic compounds as protein kinase inhibitors US Patent US10208056 Publication Date 2/19/2019
 
Cyclin-C/Cyclin-dependent kinase 8
Name:Cyclin-C/Cyclin-dependent kinase 8
Synonyms:CDK8/Cyclin C
Type:n/a
Mol. Mass.:n/a
Description:ASSAY_ID of ChEMBL is 1562017
Components:This complex has 2 components.
Component 1
Name:Cyclin-dependent kinase 8
Type:Serine/threonine-protein kinase
Mol. Mass.:53300.21
Organism:Homo sapiens (Human)
Description:P49336
Residue:464
Component 2
Name:Cyclin-C
Synonyms:CCNC Cyclin C hSRB11
Type:PROTEIN
Mol. Mass.:33244.88
Organism:Homo sapiens (Human)
Description:ChEMBL_107900
Residue:283
BDBM350202
NameBDBM350202
Synonyms:US10208056, Compound 34
TypeSmall organic molecule
Emp. Form.C13H12ClN3O2
Mol. Mass.277.706
SMILESCC1(C)Oc2cncc(Cl)c2-c2[nH]c(cc12)C(N)=O